Repository navigation
Merge commit '9998c9875efe14b90f11e0e349f70563728d1d39' #13271
Annotations
11 errors and 6 notices
|
io.sentry.uitest.android.UserInteractionTests ► composableSwipeGeneratesMatchingBreadcrumb:
sentry-android-integration-tests/sentry-uitest-android/build/outputs/androidTest-results/connected/release/TEST-test(AVD) - 11.xml#L0
Failed test found in:
sentry-android-integration-tests/sentry-uitest-android/build/outputs/androidTest-results/connected/release/TEST-test(AVD) - 11.xml
Error:
org.junit.AssumptionViolatedException: got: <false>, expected: is <true>
|
|
io.sentry.uitest.android.UserInteractionTests ► composableClickGeneratesMatchingBreadcrumb:
sentry-android-integration-tests/sentry-uitest-android/build/outputs/androidTest-results/connected/release/TEST-test(AVD) - 11.xml#L0
Failed test found in:
sentry-android-integration-tests/sentry-uitest-android/build/outputs/androidTest-results/connected/release/TEST-test(AVD) - 11.xml
Error:
org.junit.AssumptionViolatedException: got: <false>, expected: is <true>
|
|
io.sentry.uitest.android.ReplayTest ► composeReplayDoesNotLeak:
sentry-android-integration-tests/sentry-uitest-android/build/outputs/androidTest-results/connected/release/TEST-test(AVD) - 11.xml#L0
Failed test found in:
sentry-android-integration-tests/sentry-uitest-android/build/outputs/androidTest-results/connected/release/TEST-test(AVD) - 11.xml
Error:
org.junit.AssumptionViolatedException: got: <false>, expected: is <true>
|
|
io.sentry.uitest.android.EnvelopeTests ► checkEnvelopeProfiledTransaction:
sentry-android-integration-tests/sentry-uitest-android/build/outputs/androidTest-results/connected/release/TEST-test(AVD) - 11.xml#L0
Failed test found in:
sentry-android-integration-tests/sentry-uitest-android/build/outputs/androidTest-results/connected/release/TEST-test(AVD) - 11.xml
Error:
org.junit.AssumptionViolatedException: got: <[null]>, expected: every item is not null
|
|
io.sentry.uitest.android.EnvelopeTests ► checkTimedOutProfile:
sentry-android-integration-tests/sentry-uitest-android/build/outputs/androidTest-results/connected/release/TEST-test(AVD) - 11.xml#L0
Failed test found in:
sentry-android-integration-tests/sentry-uitest-android/build/outputs/androidTest-results/connected/release/TEST-test(AVD) - 11.xml
Error:
org.junit.AssumptionViolatedException: Sometimes traceFile does not exist for profiles on emulators and it fails. Although, Android Runtime is the one that manages the file, so something must be wrong with Debug.startMethodTracing
|
|
io.sentry.uitest.android.AutomaticSpansTest ► checkAppStartFramesMeasurements:
sentry-android-integration-tests/sentry-uitest-android/build/outputs/androidTest-results/connected/release/TEST-test(AVD) - 11.xml#L0
Failed test found in:
sentry-android-integration-tests/sentry-uitest-android/build/outputs/androidTest-results/connected/release/TEST-test(AVD) - 11.xml
Error:
org.junit.AssumptionViolatedException: got: <false>, expected: is <true>
|
|
io.sentry.uitest.android.ReplayTest ► composeReplayDoesNotLeak:
sentry-android-integration-tests/sentry-uitest-android/build/outputs/androidTest-results/connected/release/TEST-test(AVD) - 11.xml#L0
Failed test found in:
sentry-android-integration-tests/sentry-uitest-android/build/outputs/androidTest-results/connected/release/TEST-test(AVD) - 11.xml
Error:
org.junit.AssumptionViolatedException: got: <false>, expected: is <true>
|
|
io.sentry.uitest.android.ReplaySnapshotTest ► captureComposeReplayFrameSnapshots:
sentry-android-integration-tests/sentry-uitest-android/build/outputs/androidTest-results/connected/release/TEST-test(AVD) - 11.xml#L0
Failed test found in:
sentry-android-integration-tests/sentry-uitest-android/build/outputs/androidTest-results/connected/release/TEST-test(AVD) - 11.xml
Error:
org.junit.AssumptionViolatedException: got: <false>, expected: is <true>
|
|
io.sentry.uitest.android.EnvelopeTests ► checkEnvelopeProfiledTransaction:
sentry-android-integration-tests/sentry-uitest-android/build/outputs/androidTest-results/connected/release/TEST-test(AVD) - 11.xml#L0
Failed test found in:
sentry-android-integration-tests/sentry-uitest-android/build/outputs/androidTest-results/connected/release/TEST-test(AVD) - 11.xml
Error:
org.junit.AssumptionViolatedException: got: <[null]>, expected: every item is not null
|
|
io.sentry.uitest.android.EnvelopeTests ► checkTimedOutProfile:
sentry-android-integration-tests/sentry-uitest-android/build/outputs/androidTest-results/connected/release/TEST-test(AVD) - 11.xml#L0
Failed test found in:
sentry-android-integration-tests/sentry-uitest-android/build/outputs/androidTest-results/connected/release/TEST-test(AVD) - 11.xml
Error:
org.junit.AssumptionViolatedException: Sometimes traceFile does not exist for profiles on emulators and it fails. Although, Android Runtime is the one that manages the file, so something must be wrong with Debug.startMethodTracing
|
|
io.sentry.uitest.android.AutomaticSpansTest ► checkAppStartFramesMeasurements:
sentry-android-integration-tests/sentry-uitest-android/build/outputs/androidTest-results/connected/release/TEST-test(AVD) - 11.xml#L0
Failed test found in:
sentry-android-integration-tests/sentry-uitest-android/build/outputs/androidTest-results/connected/release/TEST-test(AVD) - 11.xml
Error:
org.junit.AssumptionViolatedException: got: <false>, expected: is <true>
|
|
AGP Matrix Release - AGP 9.2.1 - Integrations false
"The ubuntu-latest label will migrate to Ubuntu 26 beginning October 19, 2026. For more information, see https://github.com/actions/runner-images/issues/14748"
|
|
AGP Matrix Release - AGP 9.4.0 - Integrations false
"The ubuntu-latest label will migrate to Ubuntu 26 beginning October 19, 2026. For more information, see https://github.com/actions/runner-images/issues/14748"
|
|
AGP Matrix Release - AGP 9.0.0 - Integrations true
"The ubuntu-latest label will migrate to Ubuntu 26 beginning October 19, 2026. For more information, see https://github.com/actions/runner-images/issues/14748"
|
|
AGP Matrix Release - AGP 9.4.0 - Integrations true
"The ubuntu-latest label will migrate to Ubuntu 26 beginning October 19, 2026. For more information, see https://github.com/actions/runner-images/issues/14748"
|
|
AGP Matrix Release - AGP 9.2.1 - Integrations true
"The ubuntu-latest label will migrate to Ubuntu 26 beginning October 19, 2026. For more information, see https://github.com/actions/runner-images/issues/14748"
|
|
AGP Matrix Release - AGP 9.0.0 - Integrations false
"The ubuntu-latest label will migrate to Ubuntu 26 beginning October 19, 2026. For more information, see https://github.com/actions/runner-images/issues/14748"
|
Artifacts
Produced during runtime
| Name | Size | Digest | |
|---|---|---|---|
|
test-results-AGP9.0.0-Integrationsfalse
|
7.18 MB |
sha256:9c7ba59df04305542f0546db2d07b5e3c2fc8a038e0929543a17f4c7e50a859b
|
|
|
test-results-AGP9.0.0-Integrationstrue
|
7.3 MB |
sha256:77bf17b2ad98286faae387b88f2d3fc445c38f70e283940719095e4f9e426bf6
|
|
|
test-results-AGP9.2.1-Integrationsfalse
|
19.1 MB |
sha256:fd849a26c6afaea69ab1fcf29edb1303471cd3c92f103b0b6c1b7e5de577956c
|
|
|
test-results-AGP9.2.1-Integrationstrue
|
19.4 MB |
sha256:d6c9c8a221862f67a7f2b0d1e1882aa231b68da82234f2fe39fe22219e4a2a6c
|
|
|
test-results-AGP9.4.0-Integrationsfalse
|
19.4 MB |
sha256:4ea3a3c8a0b25a068774753dfc8babc9d83d0d6b5cdb0b0e2fd14e81a479dfb6
|
|
|
test-results-AGP9.4.0-Integrationstrue
|
19.8 MB |
sha256:bf5a52315d81435aa7c854e71fc91227f34b23656c788afbc60e4217ad646fc3
|
|