Repository navigation
fix(callbacks): [Callback Errors 10] Handle nonfatal throwables #13240
Annotations
11 errors and 6 notices
|
io.sentry.uitest.android.ReplayTest ► composeReplayDoesNotLeak:
sentry-android-integration-tests/sentry-uitest-android/build/outputs/androidTest-results/connected/release/TEST-test(AVD) - 11.xml#L0
Failed test found in:
sentry-android-integration-tests/sentry-uitest-android/build/outputs/androidTest-results/connected/release/TEST-test(AVD) - 11.xml
Error:
org.junit.AssumptionViolatedException: got: <false>, expected: is <true>
|
|
io.sentry.uitest.android.ReplaySnapshotTest ► captureComposeReplayFrameSnapshots:
sentry-android-integration-tests/sentry-uitest-android/build/outputs/androidTest-results/connected/release/TEST-test(AVD) - 11.xml#L0
Failed test found in:
sentry-android-integration-tests/sentry-uitest-android/build/outputs/androidTest-results/connected/release/TEST-test(AVD) - 11.xml
Error:
org.junit.AssumptionViolatedException: got: <false>, expected: is <true>
|
|
io.sentry.uitest.android.EnvelopeTests ► checkEnvelopeProfiledTransaction:
sentry-android-integration-tests/sentry-uitest-android/build/outputs/androidTest-results/connected/release/TEST-test(AVD) - 11.xml#L0
Failed test found in:
sentry-android-integration-tests/sentry-uitest-android/build/outputs/androidTest-results/connected/release/TEST-test(AVD) - 11.xml
Error:
org.junit.AssumptionViolatedException: got: <[null]>, expected: every item is not null
|
|
io.sentry.uitest.android.EnvelopeTests ► checkTimedOutProfile:
sentry-android-integration-tests/sentry-uitest-android/build/outputs/androidTest-results/connected/release/TEST-test(AVD) - 11.xml#L0
Failed test found in:
sentry-android-integration-tests/sentry-uitest-android/build/outputs/androidTest-results/connected/release/TEST-test(AVD) - 11.xml
Error:
org.junit.AssumptionViolatedException: Sometimes traceFile does not exist for profiles on emulators and it fails. Although, Android Runtime is the one that manages the file, so something must be wrong with Debug.startMethodTracing
|
|
io.sentry.uitest.android.AutomaticSpansTest ► checkAppStartFramesMeasurements:
sentry-android-integration-tests/sentry-uitest-android/build/outputs/androidTest-results/connected/release/TEST-test(AVD) - 11.xml#L0
Failed test found in:
sentry-android-integration-tests/sentry-uitest-android/build/outputs/androidTest-results/connected/release/TEST-test(AVD) - 11.xml
Error:
org.junit.AssumptionViolatedException: got: <false>, expected: is <true>
|
|
io.sentry.uitest.android.UserInteractionTests ► composableSwipeGeneratesMatchingBreadcrumb:
sentry-android-integration-tests/sentry-uitest-android/build/outputs/androidTest-results/connected/release/TEST-test(AVD) - 11.xml#L0
Failed test found in:
sentry-android-integration-tests/sentry-uitest-android/build/outputs/androidTest-results/connected/release/TEST-test(AVD) - 11.xml
Error:
org.junit.AssumptionViolatedException: got: <false>, expected: is <true>
|
|
io.sentry.uitest.android.UserInteractionTests ► composableClickGeneratesMatchingBreadcrumb:
sentry-android-integration-tests/sentry-uitest-android/build/outputs/androidTest-results/connected/release/TEST-test(AVD) - 11.xml#L0
Failed test found in:
sentry-android-integration-tests/sentry-uitest-android/build/outputs/androidTest-results/connected/release/TEST-test(AVD) - 11.xml
Error:
org.junit.AssumptionViolatedException: got: <false>, expected: is <true>
|
|
io.sentry.uitest.android.ReplayTest ► composeReplayDoesNotLeak:
sentry-android-integration-tests/sentry-uitest-android/build/outputs/androidTest-results/connected/release/TEST-test(AVD) - 11.xml#L0
Failed test found in:
sentry-android-integration-tests/sentry-uitest-android/build/outputs/androidTest-results/connected/release/TEST-test(AVD) - 11.xml
Error:
org.junit.AssumptionViolatedException: got: <false>, expected: is <true>
|
|
io.sentry.uitest.android.EnvelopeTests ► checkEnvelopeProfiledTransaction:
sentry-android-integration-tests/sentry-uitest-android/build/outputs/androidTest-results/connected/release/TEST-test(AVD) - 11.xml#L0
Failed test found in:
sentry-android-integration-tests/sentry-uitest-android/build/outputs/androidTest-results/connected/release/TEST-test(AVD) - 11.xml
Error:
org.junit.AssumptionViolatedException: got: <[null]>, expected: every item is not null
|
|
io.sentry.uitest.android.EnvelopeTests ► checkTimedOutProfile:
sentry-android-integration-tests/sentry-uitest-android/build/outputs/androidTest-results/connected/release/TEST-test(AVD) - 11.xml#L0
Failed test found in:
sentry-android-integration-tests/sentry-uitest-android/build/outputs/androidTest-results/connected/release/TEST-test(AVD) - 11.xml
Error:
org.junit.AssumptionViolatedException: Sometimes traceFile does not exist for profiles on emulators and it fails. Although, Android Runtime is the one that manages the file, so something must be wrong with Debug.startMethodTracing
|
|
io.sentry.uitest.android.AutomaticSpansTest ► checkAppStartFramesMeasurements:
sentry-android-integration-tests/sentry-uitest-android/build/outputs/androidTest-results/connected/release/TEST-test(AVD) - 11.xml#L0
Failed test found in:
sentry-android-integration-tests/sentry-uitest-android/build/outputs/androidTest-results/connected/release/TEST-test(AVD) - 11.xml
Error:
org.junit.AssumptionViolatedException: got: <false>, expected: is <true>
|
|
AGP Matrix Release - AGP 9.4.0 - Integrations true
"The ubuntu-latest label will migrate to Ubuntu 26 beginning October 19, 2026. For more information, see https://github.com/actions/runner-images/issues/14748"
|
|
AGP Matrix Release - AGP 9.0.0 - Integrations false
"The ubuntu-latest label will migrate to Ubuntu 26 beginning October 19, 2026. For more information, see https://github.com/actions/runner-images/issues/14748"
|
|
AGP Matrix Release - AGP 9.2.1 - Integrations false
"The ubuntu-latest label will migrate to Ubuntu 26 beginning October 19, 2026. For more information, see https://github.com/actions/runner-images/issues/14748"
|
|
AGP Matrix Release - AGP 9.4.0 - Integrations false
"The ubuntu-latest label will migrate to Ubuntu 26 beginning October 19, 2026. For more information, see https://github.com/actions/runner-images/issues/14748"
|
|
AGP Matrix Release - AGP 9.0.0 - Integrations true
"The ubuntu-latest label will migrate to Ubuntu 26 beginning October 19, 2026. For more information, see https://github.com/actions/runner-images/issues/14748"
|
|
AGP Matrix Release - AGP 9.2.1 - Integrations true
"The ubuntu-latest label will migrate to Ubuntu 26 beginning October 19, 2026. For more information, see https://github.com/actions/runner-images/issues/14748"
|
Artifacts
Produced during runtime
| Name | Size | Digest | |
|---|---|---|---|
|
test-results-AGP9.0.0-Integrationsfalse
|
7.17 MB |
sha256:94985822be070cc13159687f49fc3140cbac443709cff6cf4bc9f172a8739bbb
|
|
|
test-results-AGP9.0.0-Integrationstrue
|
7.3 MB |
sha256:fe01f7e2b65091c8dbd9fac5d1026f041727e43b7d85c6b896d7175779ec6d80
|
|
|
test-results-AGP9.2.1-Integrationsfalse
|
19.1 MB |
sha256:68e354ea62851cb36e8615b34cf6894c1f3eff69a36e85ed0a99b06793c92514
|
|
|
test-results-AGP9.2.1-Integrationstrue
|
19.4 MB |
sha256:fcbed996da9486be7bf57d327871271af9c894971f5b4aa288fad6d3303494f1
|
|
|
test-results-AGP9.4.0-Integrationsfalse
|
19.4 MB |
sha256:6fac4c0b8ff5100f6b7b5f8b430c45e24c95ccdea3e74ab10866913867134257
|
|
|
test-results-AGP9.4.0-Integrationstrue
|
19.7 MB |
sha256:9a308acd0f6df07e8286ec3f7efe7b1bab69efec0b2876a79b3708b893d91254
|
|