Repository navigation
fix(core): [Callback Errors 5] Handle tracesSampler failures #13146
Annotations
11 errors and 6 notices
|
io.sentry.uitest.android.UserInteractionTests ► composableSwipeGeneratesMatchingBreadcrumb:
sentry-android-integration-tests/sentry-uitest-android/build/outputs/androidTest-results/connected/release/TEST-test(AVD) - 11.xml#L0
Failed test found in:
sentry-android-integration-tests/sentry-uitest-android/build/outputs/androidTest-results/connected/release/TEST-test(AVD) - 11.xml
Error:
org.junit.AssumptionViolatedException: got: <false>, expected: is <true>
|
|
io.sentry.uitest.android.UserInteractionTests ► composableClickGeneratesMatchingBreadcrumb:
sentry-android-integration-tests/sentry-uitest-android/build/outputs/androidTest-results/connected/release/TEST-test(AVD) - 11.xml#L0
Failed test found in:
sentry-android-integration-tests/sentry-uitest-android/build/outputs/androidTest-results/connected/release/TEST-test(AVD) - 11.xml
Error:
org.junit.AssumptionViolatedException: got: <false>, expected: is <true>
|
|
io.sentry.uitest.android.ReplayTest ► composeReplayDoesNotLeak:
sentry-android-integration-tests/sentry-uitest-android/build/outputs/androidTest-results/connected/release/TEST-test(AVD) - 11.xml#L0
Failed test found in:
sentry-android-integration-tests/sentry-uitest-android/build/outputs/androidTest-results/connected/release/TEST-test(AVD) - 11.xml
Error:
org.junit.AssumptionViolatedException: got: <false>, expected: is <true>
|
|
io.sentry.uitest.android.EnvelopeTests ► checkEnvelopeProfiledTransaction:
sentry-android-integration-tests/sentry-uitest-android/build/outputs/androidTest-results/connected/release/TEST-test(AVD) - 11.xml#L0
Failed test found in:
sentry-android-integration-tests/sentry-uitest-android/build/outputs/androidTest-results/connected/release/TEST-test(AVD) - 11.xml
Error:
org.junit.AssumptionViolatedException: got: <[null]>, expected: every item is not null
|
|
io.sentry.uitest.android.EnvelopeTests ► checkTimedOutProfile:
sentry-android-integration-tests/sentry-uitest-android/build/outputs/androidTest-results/connected/release/TEST-test(AVD) - 11.xml#L0
Failed test found in:
sentry-android-integration-tests/sentry-uitest-android/build/outputs/androidTest-results/connected/release/TEST-test(AVD) - 11.xml
Error:
org.junit.AssumptionViolatedException: Sometimes traceFile does not exist for profiles on emulators and it fails. Although, Android Runtime is the one that manages the file, so something must be wrong with Debug.startMethodTracing
|
|
io.sentry.uitest.android.AutomaticSpansTest ► checkAppStartFramesMeasurements:
sentry-android-integration-tests/sentry-uitest-android/build/outputs/androidTest-results/connected/release/TEST-test(AVD) - 11.xml#L0
Failed test found in:
sentry-android-integration-tests/sentry-uitest-android/build/outputs/androidTest-results/connected/release/TEST-test(AVD) - 11.xml
Error:
org.junit.AssumptionViolatedException: got: <false>, expected: is <true>
|
|
io.sentry.uitest.android.ReplayTest ► composeReplayDoesNotLeak:
sentry-android-integration-tests/sentry-uitest-android/build/outputs/androidTest-results/connected/release/TEST-test(AVD) - 11.xml#L0
Failed test found in:
sentry-android-integration-tests/sentry-uitest-android/build/outputs/androidTest-results/connected/release/TEST-test(AVD) - 11.xml
Error:
org.junit.AssumptionViolatedException: got: <false>, expected: is <true>
|
|
io.sentry.uitest.android.ReplaySnapshotTest ► captureComposeReplayFrameSnapshots:
sentry-android-integration-tests/sentry-uitest-android/build/outputs/androidTest-results/connected/release/TEST-test(AVD) - 11.xml#L0
Failed test found in:
sentry-android-integration-tests/sentry-uitest-android/build/outputs/androidTest-results/connected/release/TEST-test(AVD) - 11.xml
Error:
org.junit.AssumptionViolatedException: got: <false>, expected: is <true>
|
|
io.sentry.uitest.android.EnvelopeTests ► checkEnvelopeProfiledTransaction:
sentry-android-integration-tests/sentry-uitest-android/build/outputs/androidTest-results/connected/release/TEST-test(AVD) - 11.xml#L0
Failed test found in:
sentry-android-integration-tests/sentry-uitest-android/build/outputs/androidTest-results/connected/release/TEST-test(AVD) - 11.xml
Error:
org.junit.AssumptionViolatedException: got: <[null]>, expected: every item is not null
|
|
io.sentry.uitest.android.EnvelopeTests ► checkTimedOutProfile:
sentry-android-integration-tests/sentry-uitest-android/build/outputs/androidTest-results/connected/release/TEST-test(AVD) - 11.xml#L0
Failed test found in:
sentry-android-integration-tests/sentry-uitest-android/build/outputs/androidTest-results/connected/release/TEST-test(AVD) - 11.xml
Error:
org.junit.AssumptionViolatedException: Sometimes traceFile does not exist for profiles on emulators and it fails. Although, Android Runtime is the one that manages the file, so something must be wrong with Debug.startMethodTracing
|
|
io.sentry.uitest.android.AutomaticSpansTest ► checkAppStartFramesMeasurements:
sentry-android-integration-tests/sentry-uitest-android/build/outputs/androidTest-results/connected/release/TEST-test(AVD) - 11.xml#L0
Failed test found in:
sentry-android-integration-tests/sentry-uitest-android/build/outputs/androidTest-results/connected/release/TEST-test(AVD) - 11.xml
Error:
org.junit.AssumptionViolatedException: got: <false>, expected: is <true>
|
|
AGP Matrix Release - AGP 9.2.1 - Integrations true
"The ubuntu-latest label will migrate to Ubuntu 26 beginning October 19, 2026. For more information, see https://github.com/actions/runner-images/issues/14748"
|
|
AGP Matrix Release - AGP 9.0.0 - Integrations true
"The ubuntu-latest label will migrate to Ubuntu 26 beginning October 19, 2026. For more information, see https://github.com/actions/runner-images/issues/14748"
|
|
AGP Matrix Release - AGP 9.4.0 - Integrations false
"The ubuntu-latest label will migrate to Ubuntu 26 beginning October 19, 2026. For more information, see https://github.com/actions/runner-images/issues/14748"
|
|
AGP Matrix Release - AGP 9.0.0 - Integrations false
"The ubuntu-latest label will migrate to Ubuntu 26 beginning October 19, 2026. For more information, see https://github.com/actions/runner-images/issues/14748"
|
|
AGP Matrix Release - AGP 9.4.0 - Integrations true
"The ubuntu-latest label will migrate to Ubuntu 26 beginning October 19, 2026. For more information, see https://github.com/actions/runner-images/issues/14748"
|
|
AGP Matrix Release - AGP 9.2.1 - Integrations false
"The ubuntu-latest label will migrate to Ubuntu 26 beginning October 19, 2026. For more information, see https://github.com/actions/runner-images/issues/14748"
|
Artifacts
Produced during runtime
| Name | Size | Digest | |
|---|---|---|---|
|
test-results-AGP9.0.0-Integrationsfalse
|
7.17 MB |
sha256:7e6b65cb7a253d43ee949e0053a61c84172d3104c1a8b7d6427369aa0a22a0dd
|
|
|
test-results-AGP9.0.0-Integrationstrue
|
7.3 MB |
sha256:cc196e1e9a86407fe4c5cc7ac4d63c74e6bc93e4e3e3232865ad23dd75d9b9fe
|
|
|
test-results-AGP9.2.1-Integrationsfalse
|
19.1 MB |
sha256:a1f0929d3523810d8aed177964fa2ebc37079f134263150f0f39dc2442856822
|
|
|
test-results-AGP9.2.1-Integrationstrue
|
19.4 MB |
sha256:5fa50e95bdd8a30f36b435be5e440452cf42f0f57f9510778da03cbd55c7c9e0
|
|
|
test-results-AGP9.4.0-Integrationsfalse
|
19.4 MB |
sha256:79180c9ebfb8598445d27db38ecf521f8204a1da9dfacfb7efefbedfa75419d9
|
|
|
test-results-AGP9.4.0-Integrationstrue
|
19.7 MB |
sha256:547b8c6c0a559ba541abe182f1bcdfed3015c98f39f840b1a8c8cabd3cf24cd3
|
|