Skip to content

ref(logging): [Logs and Metrics Enable Flags 14] Rename Logs opt-ins #13029

ref(logging): [Logs and Metrics Enable Flags 14] Rename Logs opt-ins

ref(logging): [Logs and Metrics Enable Flags 14] Rename Logs opt-ins #13029

Triggered via pull request October 1, 2026 12:04
Status Success
Total duration 10m 26s
Artifacts 6

agp-matrix.yml

on: pull_request
Matrix: agp-matrix-compatibility
Fit to window
Zoom out
Zoom in

Annotations

11 errors and 6 notices
io.sentry.uitest.android.ReplayTest ► composeReplayDoesNotLeak: sentry-android-integration-tests/sentry-uitest-android/build/outputs/androidTest-results/connected/release/TEST-test(AVD) - 11.xml#L0
Failed test found in: sentry-android-integration-tests/sentry-uitest-android/build/outputs/androidTest-results/connected/release/TEST-test(AVD) - 11.xml Error: org.junit.AssumptionViolatedException: got: <false>, expected: is <true>
io.sentry.uitest.android.ReplaySnapshotTest ► captureComposeReplayFrameSnapshots: sentry-android-integration-tests/sentry-uitest-android/build/outputs/androidTest-results/connected/release/TEST-test(AVD) - 11.xml#L0
Failed test found in: sentry-android-integration-tests/sentry-uitest-android/build/outputs/androidTest-results/connected/release/TEST-test(AVD) - 11.xml Error: org.junit.AssumptionViolatedException: got: <false>, expected: is <true>
io.sentry.uitest.android.EnvelopeTests ► checkEnvelopeProfiledTransaction: sentry-android-integration-tests/sentry-uitest-android/build/outputs/androidTest-results/connected/release/TEST-test(AVD) - 11.xml#L0
Failed test found in: sentry-android-integration-tests/sentry-uitest-android/build/outputs/androidTest-results/connected/release/TEST-test(AVD) - 11.xml Error: org.junit.AssumptionViolatedException: got: <[null]>, expected: every item is not null
io.sentry.uitest.android.EnvelopeTests ► checkTimedOutProfile: sentry-android-integration-tests/sentry-uitest-android/build/outputs/androidTest-results/connected/release/TEST-test(AVD) - 11.xml#L0
Failed test found in: sentry-android-integration-tests/sentry-uitest-android/build/outputs/androidTest-results/connected/release/TEST-test(AVD) - 11.xml Error: org.junit.AssumptionViolatedException: Sometimes traceFile does not exist for profiles on emulators and it fails. Although, Android Runtime is the one that manages the file, so something must be wrong with Debug.startMethodTracing
io.sentry.uitest.android.AutomaticSpansTest ► checkAppStartFramesMeasurements: sentry-android-integration-tests/sentry-uitest-android/build/outputs/androidTest-results/connected/release/TEST-test(AVD) - 11.xml#L0
Failed test found in: sentry-android-integration-tests/sentry-uitest-android/build/outputs/androidTest-results/connected/release/TEST-test(AVD) - 11.xml Error: org.junit.AssumptionViolatedException: got: <false>, expected: is <true>
io.sentry.uitest.android.UserInteractionTests ► composableSwipeGeneratesMatchingBreadcrumb: sentry-android-integration-tests/sentry-uitest-android/build/outputs/androidTest-results/connected/release/TEST-test(AVD) - 11.xml#L0
Failed test found in: sentry-android-integration-tests/sentry-uitest-android/build/outputs/androidTest-results/connected/release/TEST-test(AVD) - 11.xml Error: org.junit.AssumptionViolatedException: got: <false>, expected: is <true>
io.sentry.uitest.android.UserInteractionTests ► composableClickGeneratesMatchingBreadcrumb: sentry-android-integration-tests/sentry-uitest-android/build/outputs/androidTest-results/connected/release/TEST-test(AVD) - 11.xml#L0
Failed test found in: sentry-android-integration-tests/sentry-uitest-android/build/outputs/androidTest-results/connected/release/TEST-test(AVD) - 11.xml Error: org.junit.AssumptionViolatedException: got: <false>, expected: is <true>
io.sentry.uitest.android.ReplayTest ► composeReplayDoesNotLeak: sentry-android-integration-tests/sentry-uitest-android/build/outputs/androidTest-results/connected/release/TEST-test(AVD) - 11.xml#L0
Failed test found in: sentry-android-integration-tests/sentry-uitest-android/build/outputs/androidTest-results/connected/release/TEST-test(AVD) - 11.xml Error: org.junit.AssumptionViolatedException: got: <false>, expected: is <true>
io.sentry.uitest.android.EnvelopeTests ► checkEnvelopeProfiledTransaction: sentry-android-integration-tests/sentry-uitest-android/build/outputs/androidTest-results/connected/release/TEST-test(AVD) - 11.xml#L0
Failed test found in: sentry-android-integration-tests/sentry-uitest-android/build/outputs/androidTest-results/connected/release/TEST-test(AVD) - 11.xml Error: org.junit.AssumptionViolatedException: got: <[null]>, expected: every item is not null
io.sentry.uitest.android.EnvelopeTests ► checkTimedOutProfile: sentry-android-integration-tests/sentry-uitest-android/build/outputs/androidTest-results/connected/release/TEST-test(AVD) - 11.xml#L0
Failed test found in: sentry-android-integration-tests/sentry-uitest-android/build/outputs/androidTest-results/connected/release/TEST-test(AVD) - 11.xml Error: org.junit.AssumptionViolatedException: Sometimes traceFile does not exist for profiles on emulators and it fails. Although, Android Runtime is the one that manages the file, so something must be wrong with Debug.startMethodTracing
io.sentry.uitest.android.AutomaticSpansTest ► checkAppStartFramesMeasurements: sentry-android-integration-tests/sentry-uitest-android/build/outputs/androidTest-results/connected/release/TEST-test(AVD) - 11.xml#L0
Failed test found in: sentry-android-integration-tests/sentry-uitest-android/build/outputs/androidTest-results/connected/release/TEST-test(AVD) - 11.xml Error: org.junit.AssumptionViolatedException: got: <false>, expected: is <true>
AGP Matrix Release - AGP 9.4.0 - Integrations true
"The ubuntu-latest label will migrate to Ubuntu 26 beginning October 19, 2026. For more information, see https://github.com/actions/runner-images/issues/14748"
AGP Matrix Release - AGP 9.2.1 - Integrations false
"The ubuntu-latest label will migrate to Ubuntu 26 beginning October 19, 2026. For more information, see https://github.com/actions/runner-images/issues/14748"
AGP Matrix Release - AGP 9.0.0 - Integrations false
"The ubuntu-latest label will migrate to Ubuntu 26 beginning October 19, 2026. For more information, see https://github.com/actions/runner-images/issues/14748"
AGP Matrix Release - AGP 9.4.0 - Integrations false
"The ubuntu-latest label will migrate to Ubuntu 26 beginning October 19, 2026. For more information, see https://github.com/actions/runner-images/issues/14748"
AGP Matrix Release - AGP 9.0.0 - Integrations true
"The ubuntu-latest label will migrate to Ubuntu 26 beginning October 19, 2026. For more information, see https://github.com/actions/runner-images/issues/14748"
AGP Matrix Release - AGP 9.2.1 - Integrations true
"The ubuntu-latest label will migrate to Ubuntu 26 beginning October 19, 2026. For more information, see https://github.com/actions/runner-images/issues/14748"

Artifacts

Produced during runtime
Name Size Digest
test-results-AGP9.0.0-Integrationsfalse
7.17 MB
sha256:9c610e85f687327ed2e99279e2eb05af93a918ab9245a382234f6d0c1ca82968
test-results-AGP9.0.0-Integrationstrue
7.3 MB
sha256:d7317904e8d731adbb0d2b6e08b73c1b0929bf221d993c128cc00ba645ecd149
test-results-AGP9.2.1-Integrationsfalse
19.1 MB
sha256:ced363d47ab7ce7680287878219fdf22e0b4608439d6aa2aa683e656702ac431
test-results-AGP9.2.1-Integrationstrue
19.4 MB
sha256:c411d082032b4663688ea987269d240ed76e056b820894809cee945dab46ecfe
test-results-AGP9.4.0-Integrationsfalse
19.4 MB
sha256:b4594bedb4fa6f1210133466a790c21638470f62755a2c344c63199f149692bc
test-results-AGP9.4.0-Integrationstrue
19.7 MB
sha256:6eab91846670b343c294810bdaa45c0bc9b0f29e748dab00fe89c9b138f2863e